{"text_format":"1","workbook":"xlsx","n_sheets":18,"sheets":["PAGE_PRÉSEN.","Instruction","Don_tech.","Don_écon.","Cal_stab","Budget","Coût_vie","Budget Trés","Trésorerie année 1","Trésorerie année 2","Trésorerie année 3","Trésorerie année 4","Trésorerie année 5","Emprunt 1","Emprunt 2","Emprunt 3","Emprunt  supplémentaire","Calcul_CDR"],"not_rendered":{"charts":0,"images":19,"macros":1,"external_links":0,"defined_names":43,"comments":3,"pivot_tables":0},"unopened":[],"bounds":{"document_bytes":16777216,"sheet_cells":100000,"rows_first":2000,"rows_last":500,"rows_between":2000,"halvings":0,"cell_chars":16384,"cell_head_chars":4096},"cells_cut":0,"cells_raw":0,"read":"whole","date_system":"1904"}

{"sheet":"PAGE_PRÉSEN.","index":0,"n_rows":56,"n_cols":4,"rows_kept":56,"cut":false,"hidden":false,"merged":[[51,1,51,2],[55,1,55,6],[7,1,7,4],[35,1,35,4],[11,2,11,4],[15,1,33,6],[36,2,36,4],[37,2,37,4],[38,2,38,4],[39,2,39,4],[41,1,41,6],[47,2,47,4],[46,2,46,4],[45,2,45,4],[44,2,44,4],[43,1,43,2]]}
[]
[]
[]
[]
[]
[]
{"$rows_left_out":51}
{"sheet":"Instruction","index":1,"n_rows":26,"n_cols":2,"rows_kept":26,"cut":false,"hidden":false,"merged":[[5,1,5,9],[7,1,7,9],[11,1,11,9],[21,1,21,8],[23,1,23,8],[25,1,25,8],[9,1,9,8],[13,1,13,8],[19,1,19,8],[15,1,15,8],[17,1,17,8]]}
[]
[]
[]
[]
[]
[null,"     PLANIFICATION TECHNICO-ÉCONOMIQUE ET FINANCIÈRE"]
{"$rows_left_out":21}
{"sheet":"Don_tech.","index":2,"n_rows":153,"n_cols":17,"rows_kept":153,"cut":false,"hidden":false,"merged":[[7,11,7,12],[75,1,75,4],[8,1,8,4],[26,1,26,4],[49,1,49,4],[62,1,62,4],[44,1,44,4],[41,1,41,3],[42,1,42,3],[71,1,71,3],[90,1,90,3],[89,1,89,4],[90,4,99,4],[91,1,91,3],[92,1,92,3],[93,1,93,3],[95,1,95,3],[94,1,94,3],[100,1,100,4],[99,1,99,3],[98,1,98,3],[97,1,97,3],[96,1,96,3],[103,1,103,3],[103,4,112,4],[104,1,104,3],[105,1,105,3],[106,1,106,3],[107,1,107,3],[108,1,108,3],[109,1,109,3],[110,1,110,3],[111,1,111,3],[112,1,112,3],[116,1,116,3],[116,4,125,4],[117,1,117,3],[118,1,118,3],[119,1,119,3],[120,1,120,3],[121,1,121,3],[122,1,122,3],[123,1,123,3],[124,1,124,3],[125,1,125,3],[149,1,149,3],[150,1,150,3],[151,1,151,3],[129,1,129,3],[129,4,138,4],[130,1,130,3],[131,1,131,3],[132,1,132,3],[133,1,133,3],[134,1,134,3],[135,1,135,3],[136,1,136,3],[137,1,137,3],[138,1,138,3],[152,1,152,4],[141,1,141,4],[102,1,102,4],[113,1,113,4],[126,1,126,4],[115,1,115,4],[128,1,128,4],[139,1,139,4],[142,1,142,3],[142,4,151,4],[143,1,143,3],[144,1,144,3],[145,1,145,3],[146,1,146,3],[147,1,147,3],[148,1,148,3]]}
[]
[]
[]
[]
[null,{"$f":"PAGE_PRÉSEN.!B11","v":"NOM"},{"$f":"PAGE_PRÉSEN.!C11","v":"M. Jaimie LeBoeuf"}]
[null,{"$f":"PAGE_PRÉSEN.!B12","v":"ADRESSE"},{"$f":"PAGE_PRÉSEN.!C12","v":"555, rue des Vachers, St-Meuhmeuh (Québec) G0X 0X0"}]
{"$rows_left_out":148}
{"sheet":"Don_écon.","index":3,"n_rows":39,"n_cols":13,"rows_kept":39,"cut":false,"hidden":false,"merged":[[8,1,8,4],[12,1,12,4],[17,1,17,4],[22,1,22,4],[7,11,7,12]]}
[]
[]
[]
[]
[null,{"$f":"PAGE_PRÉSEN.!B11","v":"NOM"},{"$f":"PAGE_PRÉSEN.!C11","v":"M. Jaimie LeBoeuf"}]
[null,{"$f":"PAGE_PRÉSEN.!B12","v":"ADRESSE"},{"$f":"PAGE_PRÉSEN.!C12","v":"555, rue des Vachers, St-Meuhmeuh (Québec) G0X 0X0"},null,null,null,null," "," "]
{"$rows_left_out":34}
{"sheet":"Cal_stab","index":4,"n_rows":89,"n_cols":14,"rows_kept":89,"cut":false,"hidden":false,"merged":[[93,2,93,5],[94,2,94,3],[19,5,19,7],[30,1,30,2],[45,1,45,2],[60,1,60,2],[75,1,75,2],[92,2,92,5],[4,1,4,7],[15,1,15,2],[15,5,15,7],[11,1,12,7],[16,5,16,7],[6,1,6,7],[7,1,7,7],[8,1,8,7],[10,1,10,7],[9,1,9,7]]}
[]
[]
[]
[]
[null,"CALCUL DE L'ASSURANCE STABILISATION DES REVENUS AGRICOLES"]
[]
{"$rows_left_out":84}
{"sheet":"Budget","index":5,"n_rows":92,"n_cols":13,"rows_kept":92,"cut":false,"hidden":false,"merged":[[73,1,73,2],[74,1,74,2],[75,1,75,2],[76,1,76,2],[82,1,82,3],[16,10,17,10],[11,11,11,12],[8,1,8,9],[14,1,14,4],[78,1,78,4],[36,1,36,4],[39,1,39,4],[25,1,25,2],[26,1,26,2],[27,1,27,2],[28,1,28,2],[29,1,29,2],[30,1,30,2],[72,1,72,2]]}
[]
[]
[]
[]
[null,"Nom",{"$f":"PAGE_PRÉSEN.!C11","v":"M. Jaimie LeBoeuf"}]
[null,"Adresse",{"$f":"PAGE_PRÉSEN.!C12","v":"555, rue des Vachers, St-Meuhmeuh (Québec) G0X 0X0"}]
{"$rows_left_out":87}
{"sheet":"Coût_vie","index":6,"n_rows":55,"n_cols":13,"rows_kept":55,"cut":false,"hidden":false,"merged":[[53,1,53,2],[57,9,57,10],[25,1,25,2],[26,1,26,2],[27,1,27,2],[28,1,28,2],[29,1,29,2],[30,1,30,2],[31,1,31,2],[32,1,32,2],[33,1,33,2],[34,1,34,2],[35,1,35,2],[47,1,47,2],[48,1,48,2],[49,1,49,2],[9,1,9,2],[10,1,10,2],[11,1,11,2],[5,1,5,12],[7,3,7,4],[8,3,8,4],[8,5,8,6],[8,7,8,8],[8,9,8,10],[8,11,8,12],[7,5,7,6],[7,7,7,8],[7,9,7,10],[7,11,7,12],[8,1,8,2],[12,1,12,2],[13,1,13,2],[14,1,14,2],[15,1,15,2],[16,1,16,2],[17,1,17,2],[18,1,18,2],[22,1,22,2],[23,1,23,2],[24,1,24,2],[21,1,21,2],[50,1,50,2],[36,1,36,2],[40,1,40,2],[41,1,41,2],[42,1,42,2],[43,1,43,2],[39,1,39,2],[46,1,46,2]]}
[]
[null,{"$f":"PAGE_PRÉSEN.!B11","v":"NOM"},{"$f":"PAGE_PRÉSEN.!C11","v":"M. Jaimie LeBoeuf"}]
[null,{"$f":"PAGE_PRÉSEN.!B12","v":"ADRESSE"},{"$f":"PAGE_PRÉSEN.!C12","v":"555, rue des Vachers, St-Meuhmeuh (Québec) G0X 0X0"}]
[null,{"$f":"PAGE_PRÉSEN.!B13","v":"TÉLÉPHONE"},{"$f":"PAGE_PRÉSEN.!C13","v":"(450)555-5555"}]
[]
[null,"COÛT DE VIE"]
{"$rows_left_out":50}
{"sheet":"Budget Trés","index":7,"n_rows":46,"n_cols":14,"rows_kept":46,"cut":false,"hidden":true,"merged":[[7,9,7,10],[7,11,7,12],[33,1,33,2],[34,1,34,2],[8,7,8,8],[8,9,8,10],[8,11,8,12],[7,5,7,6],[25,1,25,2],[26,1,26,2],[27,1,27,2],[35,1,35,2],[42,1,42,2],[43,1,43,2],[37,1,37,2],[1,2,1,3],[18,1,18,2],[31,1,31,2],[32,1,32,2],[8,3,8,4],[7,3,7,4],[9,3,9,4],[11,1,11,2],[16,1,16,2],[29,1,29,2],[5,1,5,13],[7,7,7,8],[47,10,47,11],[50,4,50,5],[47,4,47,6],[8,5,8,6],[9,5,9,6],[9,7,9,8],[9,9,9,10],[9,11,9,12],[45,3,45,4],[45,5,45,6],[45,7,45,8],[45,9,45,10],[45,11,45,12]]}
[]
[null,{"$f":"PAGE_PRÉSEN.!B11","v":"NOM"},{"$f":"PAGE_PRÉSEN.!C11","v":"M. Jaimie LeBoeuf"}]
[null,{"$f":"PAGE_PRÉSEN.!B12","v":"ADRESSE"},{"$f":"PAGE_PRÉSEN.!C12","v":"555, rue des Vachers, St-Meuhmeuh (Québec) G0X 0X0"}]
[null,{"$f":"PAGE_PRÉSEN.!B13","v":"TÉLÉPHONE"},{"$f":"PAGE_PRÉSEN.!C13","v":"(450)555-5555"}]
[]
[null,"BUDGET DE TRÉSORERIE"]
{"$rows_left_out":41}
{"sheet":"Trésorerie année 1","index":8,"n_rows":98,"n_cols":15,"rows_kept":98,"cut":false,"hidden":false,"merged":[[0,2,0,5]]}
[null,null,"BUDGET DE TRÉSORERIE POUR L'ANNÉE:",null,null,null,{"$f":"Don_tech.!F9","v":2019}]
[]
[null,"JANVIER","FÉVRIER","MARS","AVRIL","MAI","JUIN","JUILLET","AOÛT","SEPTEMBRE","OCTOBRE","NOVEMBRE","DÉCEMBRE","ANNEE"]
["ENTRÉES"]
[{"$f":"Budget!B16","v":"Vente de veau d'embouche"},{"$f":"IF(TEXT(Don_tech.!$F$23,\"mmmm\")=B3,100%,\"\")","v":""},{"$f":"IF(TEXT(Don_tech.!$F$23,\"mmmm\")=C3,100%,\"\")","v":""},{"$f":"IF(TEXT(Don_tech.!$F$23,\"mmmm\")=D3,100%,\"\")","v":""},{"$f":"IF(TEXT(Don_tech.!$F$23,\"mmmm\")=E3,100%,\"\")","v":""},{"$f":"IF(TEXT(Don_tech.!$F$23,\"mmmm\")=F3,100%,\"\")","v":""},{"$f":"IF(TEXT(Don_tech.!$F$23,\"mmmm\")=G3,100%,\"\")","v":""},{"$f":"IF(TEXT(Don_tech.!$F$23,\"mmmm\")=H3,100%,\"\")","v":""},{"$f":"IF(TEXT(Don_tech.!$F$23,\"mmmm\")=I3,100%,\"\")","v":""},{"$f":"IF(TEXT(Don_tech.!$F$23,\"mmmm\")=J3,100%,\"\")","v":""},{"$f":"IF(TEXT(Don_tech.!$F$23,\"mmmm\")=K3,100%,\"\")","v":""},{"$f":"IF(TEXT(Don_tech.!$F$23,\"mmmm\")=L3,100%,\"\")","v":""},{"$f":"IF(TEXT(Don_tech.!$F$23,\"mmmm\")=M3,100%,\"\")","v":1},{"$f":"SUM(B5:M5)*Budget!F16","v":30723},"Periode de vente"]
[{"$f":"Budget!B17","v":"Vente de vaches réformées"},{"$f":"IF(TEXT(Don_tech.!$F$23,\"mmmm\")=B3,100%,\"\")","v":""},{"$f":"IF(TEXT(Don_tech.!$F$23,\"mmmm\")=C3,100%,\"\")","v":""},{"$f":"IF(TEXT(Don_tech.!$F$23,\"mmmm\")=D3,100%,\"\")","v":""},{"$f":"IF(TEXT(Don_tech.!$F$23,\"mmmm\")=E3,100%,\"\")","v":""},{"$f":"IF(TEXT(Don_tech.!$F$23,\"mmmm\")=F3,100%,\"\")","v":""},{"$f":"IF(TEXT(Don_tech.!$F$23,\"mmmm\")=G3,100%,\"\")","v":""},{"$f":"IF(TEXT(Don_tech.!$F$23,\"mmmm\")=H3,100%,\"\")","v":""},{"$f":"IF(TEXT(Don_tech.!$F$23,\"mmmm\")=I3,100%,\"\")","v":""},{"$f":"IF(TEXT(Don_tech.!$F$23,\"mmmm\")=J3,100%,\"\")","v":""},{"$f":"IF(TEXT(Don_tech.!$F$23,\"mmmm\")=K3,100%,\"\")","v":""},{"$f":"IF(TEXT(Don_tech.!$F$23,\"mmmm\")=L3,100%,\"\")","v":""},{"$f":"IF(TEXT(Don_tech.!$F$23,\"mmmm\")=M3,100%,\"\")","v":1},{"$f":"SUM(B6:M6)*Budget!F17","v":4576},"Periode de vente"]
{"$rows_left_out":93}
{"sheet":"Trésorerie année 2","index":9,"n_rows":98,"n_cols":15,"rows_kept":98,"cut":false,"hidden":true,"merged":[[0,2,0,5]]}
[null,null,"BUDGET DE TRÉSORERIE POUR L'ANNÉE:",null,null,null,{"$f":"'Trésorerie année 1'!G1+1","v":2020}]
[]
[null,"JANVIER","FÉVRIER","MARS","AVRIL","MAI","JUIN","JUILLET","AOÛT","SEPTEMBRE","OCTOBRE","NOVEMBRE","DÉCEMBRE","ANNEE"]
["ENTRÉES"]
[{"$f":"Budget!B16","v":"Vente de veau d'embouche"},{"$f":"IF(TEXT(Don_tech.!$G$23,\"mmmm\")=B3,100%,\"\")","v":""},{"$f":"IF(TEXT(Don_tech.!$G$23,\"mmmm\")=C3,100%,\"\")","v":""},{"$f":"IF(TEXT(Don_tech.!$G$23,\"mmmm\")=D3,100%,\"\")","v":""},{"$f":"IF(TEXT(Don_tech.!$G$23,\"mmmm\")=E3,100%,\"\")","v":""},{"$f":"IF(TEXT(Don_tech.!$G$23,\"mmmm\")=F3,100%,\"\")","v":""},{"$f":"IF(TEXT(Don_tech.!$G$23,\"mmmm\")=G3,100%,\"\")","v":""},{"$f":"IF(TEXT(Don_tech.!$G$23,\"mmmm\")=H3,100%,\"\")","v":""},{"$f":"IF(TEXT(Don_tech.!$G$23,\"mmmm\")=I3,100%,\"\")","v":""},{"$f":"IF(TEXT(Don_tech.!$G$23,\"mmmm\")=J3,100%,\"\")","v":""},{"$f":"IF(TEXT(Don_tech.!$G$23,\"mmmm\")=K3,100%,\"\")","v":""},{"$f":"IF(TEXT(Don_tech.!$G$23,\"mmmm\")=L3,100%,\"\")","v":""},{"$f":"IF(TEXT(Don_tech.!$G$23,\"mmmm\")=M3,100%,\"\")","v":1},{"$f":"SUM(B5:M5)*Budget!G16","v":46084.5},"Periode de vente"]
[{"$f":"Budget!B17","v":"Vente de vaches réformées"},{"$f":"IF(TEXT(Don_tech.!$G$23,\"mmmm\")=B3,100%,\"\")","v":""},{"$f":"IF(TEXT(Don_tech.!$G$23,\"mmmm\")=C3,100%,\"\")","v":""},{"$f":"IF(TEXT(Don_tech.!$G$23,\"mmmm\")=D3,100%,\"\")","v":""},{"$f":"IF(TEXT(Don_tech.!$G$23,\"mmmm\")=E3,100%,\"\")","v":""},{"$f":"IF(TEXT(Don_tech.!$G$23,\"mmmm\")=F3,100%,\"\")","v":""},{"$f":"IF(TEXT(Don_tech.!$G$23,\"mmmm\")=G3,100%,\"\")","v":""},{"$f":"IF(TEXT(Don_tech.!$G$23,\"mmmm\")=H3,100%,\"\")","v":""},{"$f":"IF(TEXT(Don_tech.!$G$23,\"mmmm\")=I3,100%,\"\")","v":""},{"$f":"IF(TEXT(Don_tech.!$G$23,\"mmmm\")=J3,100%,\"\")","v":""},{"$f":"IF(TEXT(Don_tech.!$G$23,\"mmmm\")=K3,100%,\"\")","v":""},{"$f":"IF(TEXT(Don_tech.!$G$23,\"mmmm\")=L3,100%,\"\")","v":""},{"$f":"IF(TEXT(Don_tech.!$G$23,\"mmmm\")=M3,100%,\"\")","v":1},{"$f":"SUM(B6:M6)*Budget!G17","v":5720},"Periode de vente"]
{"$rows_left_out":93}
{"sheet":"Trésorerie année 3","index":10,"n_rows":98,"n_cols":15,"rows_kept":98,"cut":false,"hidden":true,"merged":[[0,2,0,5]]}
[null,null,"BUDGET DE TRÉSORERIE POUR L'ANNÉE:",null,null,null,{"$f":"'Trésorerie année 1'!G1+2","v":2021}]
[]
[null,"JANVIER","FÉVRIER","MARS","AVRIL","MAI","JUIN","JUILLET","AOÛT","SEPTEMBRE","OCTOBRE","NOVEMBRE","DÉCEMBRE","ANNEE"]
["ENTRÉES"]
[{"$f":"Budget!B16","v":"Vente de veau d'embouche"},{"$f":"IF(TEXT(Don_tech.!$H$23,\"mmmm\")=B3,100%,\"\")","v":""},{"$f":"IF(TEXT(Don_tech.!$H$23,\"mmmm\")=C3,100%,\"\")","v":""},{"$f":"IF(TEXT(Don_tech.!$H$23,\"mmmm\")=D3,100%,\"\")","v":""},{"$f":"IF(TEXT(Don_tech.!$H$23,\"mmmm\")=E3,100%,\"\")","v":""},{"$f":"IF(TEXT(Don_tech.!$H$23,\"mmmm\")=F3,100%,\"\")","v":""},{"$f":"IF(TEXT(Don_tech.!$H$23,\"mmmm\")=G3,100%,\"\")","v":""},{"$f":"IF(TEXT(Don_tech.!$H$23,\"mmmm\")=H3,100%,\"\")","v":""},{"$f":"IF(TEXT(Don_tech.!$H$23,\"mmmm\")=I3,100%,\"\")","v":""},{"$f":"IF(TEXT(Don_tech.!$H$23,\"mmmm\")=J3,100%,\"\")","v":""},{"$f":"IF(TEXT(Don_tech.!$H$23,\"mmmm\")=K3,100%,\"\")","v":""},{"$f":"IF(TEXT(Don_tech.!$H$23,\"mmmm\")=L3,100%,\"\")","v":""},{"$f":"IF(TEXT(Don_tech.!$H$23,\"mmmm\")=M3,100%,\"\")","v":1},{"$f":"SUM(B5:M5)*Budget!H16","v":55705.187999999995},"Periode de vente"]
[{"$f":"Budget!B17","v":"Vente de vaches réformées"},{"$f":"IF(TEXT(Don_tech.!$H$23,\"mmmm\")=B3,100%,\"\")","v":""},{"$f":"IF(TEXT(Don_tech.!$H$23,\"mmmm\")=C3,100%,\"\")","v":""},{"$f":"IF(TEXT(Don_tech.!$H$23,\"mmmm\")=D3,100%,\"\")","v":""},{"$f":"IF(TEXT(Don_tech.!$H$23,\"mmmm\")=E3,100%,\"\")","v":""},{"$f":"IF(TEXT(Don_tech.!$H$23,\"mmmm\")=F3,100%,\"\")","v":""},{"$f":"IF(TEXT(Don_tech.!$H$23,\"mmmm\")=G3,100%,\"\")","v":""},{"$f":"IF(TEXT(Don_tech.!$H$23,\"mmmm\")=H3,100%,\"\")","v":""},{"$f":"IF(TEXT(Don_tech.!$H$23,\"mmmm\")=I3,100%,\"\")","v":""},{"$f":"IF(TEXT(Don_tech.!$H$23,\"mmmm\")=J3,100%,\"\")","v":""},{"$f":"IF(TEXT(Don_tech.!$H$23,\"mmmm\")=K3,100%,\"\")","v":""},{"$f":"IF(TEXT(Don_tech.!$H$23,\"mmmm\")=L3,100%,\"\")","v":""},{"$f":"IF(TEXT(Don_tech.!$H$23,\"mmmm\")=M3,100%,\"\")","v":1},{"$f":"SUM(B6:M6)*Budget!H17","v":6864},"Periode de vente"]
{"$rows_left_out":93}
{"sheet":"Trésorerie année 4","index":11,"n_rows":98,"n_cols":15,"rows_kept":98,"cut":false,"hidden":true,"merged":[[0,2,0,5]]}
[null,null,"BUDGET DE TRÉSORERIE POUR L'ANNÉE:",null,null,null,{"$f":"'Trésorerie année 1'!G1+3","v":2022}]
[]
[null,"JANVIER","FÉVRIER","MARS","AVRIL","MAI","JUIN","JUILLET","AOÛT","SEPTEMBRE","OCTOBRE","NOVEMBRE","DÉCEMBRE","ANNEE"]
["ENTRÉES"]
[{"$f":"Budget!B16","v":"Vente de veau d'embouche"},{"$f":"IF(TEXT(Don_tech.!$I$23,\"mmmm\")=B3,100%,\"\")","v":""},{"$f":"IF(TEXT(Don_tech.!$I$23,\"mmmm\")=C3,100%,\"\")","v":""},{"$f":"IF(TEXT(Don_tech.!$I$23,\"mmmm\")=D3,100%,\"\")","v":""},{"$f":"IF(TEXT(Don_tech.!$I$23,\"mmmm\")=E3,100%,\"\")","v":""},{"$f":"IF(TEXT(Don_tech.!$I$23,\"mmmm\")=F3,100%,\"\")","v":""},{"$f":"IF(TEXT(Don_tech.!$I$23,\"mmmm\")=G3,100%,\"\")","v":""},{"$f":"IF(TEXT(Don_tech.!$I$23,\"mmmm\")=H3,100%,\"\")","v":""},{"$f":"IF(TEXT(Don_tech.!$I$23,\"mmmm\")=I3,100%,\"\")","v":""},{"$f":"IF(TEXT(Don_tech.!$I$23,\"mmmm\")=J3,100%,\"\")","v":""},{"$f":"IF(TEXT(Don_tech.!$I$23,\"mmmm\")=K3,100%,\"\")","v":""},{"$f":"IF(TEXT(Don_tech.!$I$23,\"mmmm\")=L3,100%,\"\")","v":""},{"$f":"IF(TEXT(Don_tech.!$I$23,\"mmmm\")=M3,100%,\"\")","v":1},{"$f":"SUM(B5:M5)*Budget!I16","v":76122.816000000006},"Periode de vente"]
[{"$f":"Budget!B17","v":"Vente de vaches réformées"},{"$f":"IF(TEXT(Don_tech.!$I$23,\"mmmm\")=B3,100%,\"\")","v":""},{"$f":"IF(TEXT(Don_tech.!$I$23,\"mmmm\")=C3,100%,\"\")","v":""},{"$f":"IF(TEXT(Don_tech.!$I$23,\"mmmm\")=D3,100%,\"\")","v":""},{"$f":"IF(TEXT(Don_tech.!$I$23,\"mmmm\")=E3,100%,\"\")","v":""},{"$f":"IF(TEXT(Don_tech.!$I$23,\"mmmm\")=F3,100%,\"\")","v":""},{"$f":"IF(TEXT(Don_tech.!$I$23,\"mmmm\")=G3,100%,\"\")","v":""},{"$f":"IF(TEXT(Don_tech.!$I$23,\"mmmm\")=H3,100%,\"\")","v":""},{"$f":"IF(TEXT(Don_tech.!$I$23,\"mmmm\")=I3,100%,\"\")","v":""},{"$f":"IF(TEXT(Don_tech.!$I$23,\"mmmm\")=J3,100%,\"\")","v":""},{"$f":"IF(TEXT(Don_tech.!$I$23,\"mmmm\")=K3,100%,\"\")","v":""},{"$f":"IF(TEXT(Don_tech.!$I$23,\"mmmm\")=L3,100%,\"\")","v":""},{"$f":"IF(TEXT(Don_tech.!$I$23,\"mmmm\")=M3,100%,\"\")","v":1},{"$f":"SUM(B6:M6)*Budget!I17","v":9152},"Periode de vente"]
{"$rows_left_out":93}
{"sheet":"Trésorerie année 5","index":12,"n_rows":98,"n_cols":15,"rows_kept":98,"cut":false,"hidden":true,"merged":[[0,2,0,5]]}
[null,null,"BUDGET DE TRÉSORERIE POUR L'ANNÉE:",null,null,null,{"$f":"'Trésorerie année 1'!G1+4","v":2023}]
[]
[null,"JANVIER","FÉVRIER","MARS","AVRIL","MAI","JUIN","JUILLET","AOÛT","SEPTEMBRE","OCTOBRE","NOVEMBRE","DÉCEMBRE","ANNEE"]
["ENTRÉES"]
[{"$f":"Budget!B16","v":"Vente de veau d'embouche"},{"$f":"IF(TEXT(Don_tech.!$J$23,\"mmmm\")=B3,100%,\"\")","v":""},{"$f":"IF(TEXT(Don_tech.!$J$23,\"mmmm\")=C3,100%,\"\")","v":""},{"$f":"IF(TEXT(Don_tech.!$J$23,\"mmmm\")=D3,100%,\"\")","v":""},{"$f":"IF(TEXT(Don_tech.!$J$23,\"mmmm\")=E3,100%,\"\")","v":""},{"$f":"IF(TEXT(Don_tech.!$J$23,\"mmmm\")=F3,100%,\"\")","v":""},{"$f":"IF(TEXT(Don_tech.!$J$23,\"mmmm\")=G3,100%,\"\")","v":""},{"$f":"IF(TEXT(Don_tech.!$J$23,\"mmmm\")=H3,100%,\"\")","v":""},{"$f":"IF(TEXT(Don_tech.!$J$23,\"mmmm\")=I3,100%,\"\")","v":""},{"$f":"IF(TEXT(Don_tech.!$J$23,\"mmmm\")=J3,100%,\"\")","v":""},{"$f":"IF(TEXT(Don_tech.!$J$23,\"mmmm\")=K3,100%,\"\")","v":""},{"$f":"IF(TEXT(Don_tech.!$J$23,\"mmmm\")=L3,100%,\"\")","v":""},{"$f":"IF(TEXT(Don_tech.!$J$23,\"mmmm\")=M3,100%,\"\")","v":1},{"$f":"SUM(B5:M5)*Budget!J16","v":90395.843999999997},"Periode de vente"]
[{"$f":"Budget!B17","v":"Vente de vaches réformées"},{"$f":"IF(TEXT(Don_tech.!$J$23,\"mmmm\")=B3,100%,\"\")","v":""},{"$f":"IF(TEXT(Don_tech.!$J$23,\"mmmm\")=C3,100%,\"\")","v":""},{"$f":"IF(TEXT(Don_tech.!$J$23,\"mmmm\")=D3,100%,\"\")","v":""},{"$f":"IF(TEXT(Don_tech.!$J$23,\"mmmm\")=E3,100%,\"\")","v":""},{"$f":"IF(TEXT(Don_tech.!$J$23,\"mmmm\")=F3,100%,\"\")","v":""},{"$f":"IF(TEXT(Don_tech.!$J$23,\"mmmm\")=G3,100%,\"\")","v":""},{"$f":"IF(TEXT(Don_tech.!$J$23,\"mmmm\")=H3,100%,\"\")","v":""},{"$f":"IF(TEXT(Don_tech.!$J$23,\"mmmm\")=I3,100%,\"\")","v":""},{"$f":"IF(TEXT(Don_tech.!$J$23,\"mmmm\")=J3,100%,\"\")","v":""},{"$f":"IF(TEXT(Don_tech.!$J$23,\"mmmm\")=K3,100%,\"\")","v":""},{"$f":"IF(TEXT(Don_tech.!$J$23,\"mmmm\")=L3,100%,\"\")","v":""},{"$f":"IF(TEXT(Don_tech.!$J$23,\"mmmm\")=M3,100%,\"\")","v":1},{"$f":"SUM(B6:M6)*Budget!JI17","v":0},"Periode de vente"]
{"$rows_left_out":93}
{"sheet":"Emprunt 1","index":13,"n_rows":390,"n_cols":15,"rows_kept":390,"cut":false,"hidden":false,"merged":[[19,1,19,2],[10,3,10,5],[8,1,8,7]]}
[]
[]
[]
[]
[null,"Nom",{"$f":"PAGE_PRÉSEN.!C11","v":"M. Jaimie LeBoeuf"}]
[null,"Adresse",{"$f":"PAGE_PRÉSEN.!C12","v":"555, rue des Vachers, St-Meuhmeuh (Québec) G0X 0X0"}]
{"$rows_left_out":385}
{"sheet":"Emprunt 2","index":14,"n_rows":390,"n_cols":15,"rows_kept":390,"cut":false,"hidden":true,"merged":[[8,1,8,7],[10,3,10,5],[19,1,19,2]]}
[]
[]
[]
[]
[null,"Nom",{"$f":"PAGE_PRÉSEN.!C11","v":"M. Jaimie LeBoeuf"}]
[null,"Adresse",{"$f":"PAGE_PRÉSEN.!C12","v":"555, rue des Vachers, St-Meuhmeuh (Québec) G0X 0X0"}]
{"$rows_left_out":385}
{"sheet":"Emprunt 3","index":15,"n_rows":390,"n_cols":15,"rows_kept":390,"cut":false,"hidden":true,"merged":[[8,1,8,7],[10,3,10,5],[19,1,19,2]]}
[]
[]
[]
[]
[null,"Nom",{"$f":"PAGE_PRÉSEN.!C11","v":"M. Jaimie LeBoeuf"}]
[null,"Adresse",{"$f":"PAGE_PRÉSEN.!C12","v":"555, rue des Vachers, St-Meuhmeuh (Québec) G0X 0X0"}]
{"$rows_left_out":385}
{"sheet":"Emprunt  supplémentaire","index":16,"n_rows":390,"n_cols":15,"rows_kept":390,"cut":false,"hidden":true,"merged":[[8,1,8,7],[10,3,10,5],[19,1,19,2]]}
[]
[]
[]
[]
[null,"Nom",{"$f":"PAGE_PRÉSEN.!C11","v":"M. Jaimie LeBoeuf"}]
[null,"Adresse",{"$f":"PAGE_PRÉSEN.!C12","v":"555, rue des Vachers, St-Meuhmeuh (Québec) G0X 0X0"}]
{"$rows_left_out":385}
{"sheet":"Calcul_CDR","index":17,"n_rows":38,"n_cols":8,"rows_kept":38,"cut":false,"hidden":false,"merged":[[20,1,20,2],[22,1,22,2],[18,1,18,2],[24,1,24,2],[37,1,37,2],[26,1,26,2],[28,1,28,2],[30,1,30,2],[32,1,32,2],[36,1,36,2],[34,1,34,2],[8,1,8,7],[11,1,11,2],[12,1,12,2],[14,1,14,2],[16,1,16,2]]}
[]
[]
[]
[]
[null,"Nom",{"$f":"PAGE_PRÉSEN.!C11","v":"M. Jaimie LeBoeuf"}]
[null,"Adresse",{"$f":"PAGE_PRÉSEN.!C12","v":"555, rue des Vachers, St-Meuhmeuh (Québec) G0X 0X0"}]
{"$rows_left_out":32}