{"text_format":"1","workbook":"xlsx","n_sheets":6,"sheets":["Guide d'utilisation","Trésorerie","Réalisé","Emprunt","Capitalisation mensuelle","Capitalisation semestrielle"],"not_rendered":{"charts":0,"images":2,"macros":1,"external_links":0,"defined_names":1,"comments":2,"pivot_tables":0},"unopened":[],"bounds":{"document_bytes":16777216,"sheet_cells":100000,"rows_first":2000,"rows_last":500,"rows_between":2000,"halvings":0,"cell_chars":16384,"cell_head_chars":4096},"cells_cut":0,"cells_raw":0,"read":"whole","date_system":"1900"}

{"sheet":"Guide d'utilisation","index":0,"n_rows":24,"n_cols":15,"rows_kept":24,"cut":false,"hidden":false,"merged":[[19,1,19,11],[18,1,18,11],[12,1,12,11],[17,1,17,11],[11,1,11,11],[13,1,13,11],[14,1,14,11],[15,1,15,11],[16,1,16,11]]}
[]
[]
[]
[]
[]
[]
[]
[]
[]
[]
[]
[null,"Guide d'utilisation :"]
[null,"Il faut inscrire le mois de départ du budget à l'aide du menu déroulant situé à la ligne 2 en haut à gauche dans l'onglet « Trésorerie »."]
[null,"Les cellules noires représentent les totaux à fournir par l'utilisateur."]
[null,"Les cellules blanches doivent être remplies par l'utilisateur pour la répartition des montants par mois."]
[null,"Les cellules dans la colonne « Vérification » deviennent rouges si la ligne ne balance pas. "]
[null,"Le montant remboursé sur la marge de crédit est automatiquement le maximum disponible à l'encaisse."]
[null,"L'utilisateur doit ajuster le pourcentage des intérêts annuels sur la marge de crédit à l'aide des boutons situés en bas de la grille. ",null,null,null,null,null,null,null,null,null,null,null,null," "]
[null,"Le solde bancaire du début et la marge de crédit accumulée le mois précédent doivent être saisis dès le départ aux lignes 72 et 79."]
[null,"Dans l'onglet « Réalisé », il faut saisir les données réelles après trois, six ou neuf mois si on veut faire un suivi."]
{"$rows_left_out":5}
{"sheet":"Trésorerie","index":1,"n_rows":85,"n_cols":33,"rows_kept":85,"cut":false,"hidden":false,"merged":[[19,12,19,13],[0,12,0,13],[84,1,84,8],[80,3,81,3],[0,2,0,6],[0,8,0,10],[19,8,19,10],[19,2,19,6]]}
[null,"Nom de l'entreprise : ",null,null,null,null,null,"Production : ",null,null,null,"Année : "]
[null,"Premier mois (choisir)",{"$f":"VLOOKUP($R$3,$T$3:$AF$14,2,0)","v":"Mai"},{"$f":"VLOOKUP($R$3,$T$3:$AF$14,3,0)","v":"Juin"},{"$f":"VLOOKUP($R$3,$T$3:$AF$14,4,0)","v":"Juillet"},{"$f":"VLOOKUP($R$3,$T$3:$AF$14,5,0)","v":"Août"},{"$f":"VLOOKUP($R$3,$T$3:$AF$14,6,0)","v":"Septembre"},{"$f":"VLOOKUP($R$3,$T$3:$AF$14,7,0)","v":"Octobre"},{"$f":"VLOOKUP($R$3,$T$3:$AF$14,8,0)","v":"Novembre"},{"$f":"VLOOKUP($R$3,$T$3:$AF$14,9,0)","v":"Décembre"},{"$f":"VLOOKUP($R$3,$T$3:$AF$14,10,0)","v":"Janvier"},{"$f":"VLOOKUP($R$3,$T$3:$AF$14,11,0)","v":"Février"},{"$f":"VLOOKUP($R$3,$T$3:$AF$14,12,0)","v":"Mars"},{"$f":"VLOOKUP($R$3,$T$3:$AF$14,13,0)","v":"Avril"},"Total","Validation"]
[null,"Recettes d'exploitation",null,null,null,null,null,null,null,null,null,null,null,null,null,null,null,5,"Janvier",1,"Janvier","Février","Mars","Avril","Mai","Juin","Juillet","Août","Septembre","Octobre","Novembre","Décembre"]
[null,null,null,null,null,null,null,null,null,null,null,null,null,null,null,{"$f":"SUM(C4:N4)","v":0},null,null,"Février",2,"Février","Mars","Avril","Mai","Juin","Juillet","Août","Septembre","Octobre","Novembre","Décembre","Janvier"]
[null,null,null,null,null,null,null,null,null,null,null,null,null,null,null,{"$f":"SUM(C5:N5)","v":0},null,null,"Mars",3,"Mars","Avril","Mai","Juin","Juillet","Août","Septembre","Octobre","Novembre","Décembre","Janvier","Février"]
[null,null,null,null,null,null,null,null,null,null,null,null,null,null,null,{"$f":"SUM(C6:N6)","v":0},null,null,"Avril",4,"Avril","Mai","Juin","Juillet","Août","Septembre","Octobre","Novembre","Décembre","Janvier","Février","Mars"]
[null,null,null,null,null,null,null,null,null,null,null,null,null,null,null,{"$f":"SUM(C7:N7)","v":0},null,null,"Mai",5,"Mai","Juin","Juillet","Août","Septembre","Octobre","Novembre","Décembre","Janvier","Février","Mars","Avril"]
[null,null,null,null,null,null,null,null,null,null,null,null,null,null,null,0,null,null,"Juin",6,"Juin","Juillet","Août","Septembre","Octobre","Novembre","Décembre","Janvier","Février","Mars","Avril","Mai"]
[null,null,null,null,null,null,null,null,null,null,null,null,null,null,null,0,null,null,"Juillet",7,"Juillet","Août","Septembre","Octobre","Novembre","Décembre","Janvier","Février","Mars","Avril","Mai","Juin"]
[null,null,null,null,null,null,null,null,null,null,null,null,null,null,null,0,null,null,"Août",8,"Août","Septembre","Octobre","Novembre","Décembre","Janvier","Février","Mars","Avril","Mai","Juin","Juillet",1234]
[null,null,null,null,null,null,null,null,null,null,null,null,null,null,null,0,null,null,"Septembre",9,"Septembre","Octobre","Novembre","Décembre","Janvier","Février","Mars","Avril","Mai","Juin","Juillet","Août"]
[null,null,null,null,null,null,null,null,null,null,null,null,null,null,null,0,null,null,"Octobre",10,"Octobre","Novembre","Décembre","Janvier","Février","Mars","Avril","Mai","Juin","Juillet","Août","Septembre"]
[null,null,null,null,null,null,null,null,null,null,null,null,null,null,null,0,null,null,"Novembre",11,"Novembre","Décembre","Janvier","Février","Mars","Avril","Mai","Juin","Juillet","Août","Septembre","Octobre"]
[null,null,null,null,null,null,null,null,null,null,null,null,null,null,null,0,null,null,"Décembre",12,"Décembre","Janvier","Février","Mars","Avril","Mai","Juin","Juillet","Août","Septembre","Octobre","Novembre"]
[null,null,null,null,null,null,null,null,null,null,null,null,null,null,null,0]
[null,null,null,null,null,null,null,null,null,null,null,null,null,null,null,0]
[null,null,null,null,null,null,null,null,null,null,null,null,null,null,null,0]
[null,null,null,null,null,null,null,null,null,null,null,null,null,null,null,0]
[null,"Total des recettes d'expl. (A)",{"$f":"SUM(C4:C18)","v":0},0,0,0,0,0,0,0,0,0,0,0,0,{"$f":"SUM(C19:N19)","v":0}]
[]
{"$rows_left_out":66}
{"sheet":"Réalisé","index":2,"n_rows":71,"n_cols":10,"rows_kept":71,"cut":false,"hidden":false,"merged":[[18,1,18,5]]}
[]
[null,"Recettes d'exploitation\n","Budget ($)\nsur 12 mois","Réalisé ($)\nen 3 mois","%","Réalisé ($)\nen 6 mois","%","Réalisé ($)\nen 9 mois","%","% \nréalisé"]
[null,{"$f":"IF(Trésorerie!B4=\"\",\"\",Trésorerie!B4)","v":""},{"$f":"IF(Trésorerie!O4=\"\",\"\",Trésorerie!O4)","v":""},null,{"$f":"IF(C3=\"\",\"\",(D3/C3)*100)","v":""},null,{"$f":"IF(C3=\"\",\"\",(F3/C3)*100)","v":""},null,{"$f":"IF(C3=\"\",\"\",(H3/C3)*100)","v":""},{"$f":"IFERROR(E3+G3+I3,\"\")","v":""}]
[null,{"$f":"IF(Trésorerie!B5=\"\",\"\",Trésorerie!B5)","v":""},{"$f":"IF(Trésorerie!O5=\"\",\"\",Trésorerie!O5)","v":""},null,{"$f":"IF(C4=\"\",\"\",(D4/C4)*100)","v":""},null,{"$f":"IF(C4=\"\",\"\",(F4/C4)*100)","v":""},null,{"$f":"IF(C4=\"\",\"\",(H4/C4)*100)","v":""},{"$f":"IFERROR(E4+G4+I4,\"\")","v":""}]
[null,{"$f":"IF(Trésorerie!B6=\"\",\"\",Trésorerie!B6)","v":""},{"$f":"IF(Trésorerie!O6=\"\",\"\",Trésorerie!O6)","v":""},null,"",null,"",null,"",{"$f":"IFERROR(E5+G5+I5,\"\")","v":""}]
[null,{"$f":"IF(Trésorerie!B7=\"\",\"\",Trésorerie!B7)","v":""},{"$f":"IF(Trésorerie!O7=\"\",\"\",Trésorerie!O7)","v":""},null,"",null,"",null,"",{"$f":"IFERROR(E6+G6+I6,\"\")","v":""}]
[null,{"$f":"IF(Trésorerie!B8=\"\",\"\",Trésorerie!B8)","v":""},{"$f":"IF(Trésorerie!O8=\"\",\"\",Trésorerie!O8)","v":""},null,"",null,"",null,"",""]
[null,{"$f":"IF(Trésorerie!B9=\"\",\"\",Trésorerie!B9)","v":""},{"$f":"IF(Trésorerie!O9=\"\",\"\",Trésorerie!O9)","v":""},null,"",null,"",null,"",""]
[null,{"$f":"IF(Trésorerie!B10=\"\",\"\",Trésorerie!B10)","v":""},{"$f":"IF(Trésorerie!O10=\"\",\"\",Trésorerie!O10)","v":""},null,"",null,"",null,"",""]
[null,{"$f":"IF(Trésorerie!B11=\"\",\"\",Trésorerie!B11)","v":""},{"$f":"IF(Trésorerie!O11=\"\",\"\",Trésorerie!O11)","v":""},null,"",null,"",null,"",""]
[null,{"$f":"IF(Trésorerie!B12=\"\",\"\",Trésorerie!B12)","v":""},{"$f":"IF(Trésorerie!O12=\"\",\"\",Trésorerie!O12)","v":""},null,"",null,"","","",""]
[null,{"$f":"IF(Trésorerie!B13=\"\",\"\",Trésorerie!B13)","v":""},{"$f":"IF(Trésorerie!O13=\"\",\"\",Trésorerie!O13)","v":""},null,"","","","","",""]
[null,{"$f":"IF(Trésorerie!B14=\"\",\"\",Trésorerie!B14)","v":""},{"$f":"IF(Trésorerie!O14=\"\",\"\",Trésorerie!O14)","v":""},null,"","","","","",""]
[null,{"$f":"IF(Trésorerie!B15=\"\",\"\",Trésorerie!B15)","v":""},{"$f":"IF(Trésorerie!O15=\"\",\"\",Trésorerie!O15)","v":""},"","","","","","",""]
[null,{"$f":"IF(Trésorerie!B16=\"\",\"\",Trésorerie!B16)","v":""},{"$f":"IF(Trésorerie!O16=\"\",\"\",Trésorerie!O16)","v":""},"","","","","","",""]
[null,{"$f":"IF(Trésorerie!B17=\"\",\"\",Trésorerie!B17)","v":""},{"$f":"IF(Trésorerie!O17=\"\",\"\",Trésorerie!O17)","v":""},"","","","","","",""]
[null,{"$f":"IF(Trésorerie!B18=\"\",\"\",Trésorerie!B18)","v":""},{"$f":"IF(Trésorerie!O18=\"\",\"\",Trésorerie!O18)","v":""},"","","","","","",""]
[null,"Total des recettes d'expl. (A)",{"$f":"SUM(C3:C17)","v":0},{"$f":"SUM(D3:D17)","v":0},null,{"$f":"SUM(F3:F17)","v":0},null,{"$f":"SUM(H3:H17)","v":0}]
[]
[null,"Déboursés d'exploitation","Budget ($)\nsur 12 mois","Réalisé ($)\nen 3 mois","%","Réalisé ($)\nen 6 mois","%","Réalisé ($)\nen 9 mois","%","% \nréalisé"]
{"$rows_left_out":52}
{"sheet":"Emprunt","index":3,"n_rows":43,"n_cols":14,"rows_kept":43,"cut":false,"hidden":false,"merged":[[3,8,3,11],[12,1,12,2],[12,3,12,4],[3,3,3,4],[4,3,4,4],[5,3,5,4],[3,1,3,2],[4,1,4,2],[5,1,5,2]]}
[]
[null,"1. Saisir les renseignements relatifs à l'emprunt."]
[]
[null,"Somme empruntée ($)",null,40000]
[null,"Taux d'intérêt (%)",null,5]
[null,"Amortissement* (nombre d'années)",null,7]
[]
[null,"*Durée de l'amortissement du calculateur : jusqu'à 25 ans."]
[]
[]
[null,"2. Sélectionner la période."]
[]
[null,"Choix de la période",null,"An 1"]
[]
[]
[null,"3. Choisir la capitalisation appropriée et utiliser les renseignements suivants pour remplir les lignes 66 et 68 de l'onglet « Trésorerie »."]
[]
[null,"Capitalisation mensuelle (12 mois par année)"]
[null,"Pour les colonnes B à M"]
[null,"Mois",{"$f":"VLOOKUP($D$13,'Capitalisation mensuelle'!$H$8:$T$32,2,FALSE)","v":1},{"$f":"VLOOKUP($D$13,'Capitalisation mensuelle'!$H$8:$T$32,3,FALSE)","v":2},{"$f":"VLOOKUP($D$13,'Capitalisation mensuelle'!$H$8:$T$32,4,FALSE)","v":3},{"$f":"VLOOKUP($D$13,'Capitalisation mensuelle'!$H$8:$T$32,5,FALSE)","v":4},{"$f":"VLOOKUP($D$13,'Capitalisation mensuelle'!$H$8:$T$32,6,FALSE)","v":5},{"$f":"VLOOKUP($D$13,'Capitalisation mensuelle'!$H$8:$T$32,7,FALSE)","v":6},{"$f":"VLOOKUP($D$13,'Capitalisation mensuelle'!$H$8:$T$32,8,FALSE)","v":7},{"$f":"VLOOKUP($D$13,'Capitalisation mensuelle'!$H$8:$T$32,9,FALSE)","v":8},{"$f":"VLOOKUP($D$13,'Capitalisation mensuelle'!$H$8:$T$32,10,FALSE)","v":9},{"$f":"VLOOKUP($D$13,'Capitalisation mensuelle'!$H$8:$T$32,11,FALSE)","v":10},{"$f":"VLOOKUP($D$13,'Capitalisation mensuelle'!$H$8:$T$32,12,FALSE)","v":11},{"$f":"VLOOKUP($D$13,'Capitalisation mensuelle'!$H$8:$T$32,13,FALSE)","v":12}]
{"$rows_left_out":24}
{"sheet":"Capitalisation mensuelle","index":4,"n_rows":308,"n_cols":22,"rows_kept":308,"cut":false,"hidden":true,"merged":[[8,4,19,4],[20,4,31,4],[32,4,43,4],[164,4,175,4],[176,4,187,4],[44,4,55,4],[56,4,67,4],[68,4,79,4],[80,4,91,4],[92,4,103,4],[188,4,199,4],[200,4,211,4],[212,4,223,4],[104,4,115,4],[116,4,127,4],[128,4,139,4],[140,4,151,4],[152,4,163,4],[272,4,283,4],[284,4,295,4],[296,4,307,4],[224,4,235,4],[236,4,247,4],[248,4,259,4],[260,4,271,4],[4,0,4,1],[4,2,4,3],[2,0,2,1],[2,2,2,3],[3,0,3,1],[3,2,3,3]]}
["Capitalisation mensuelle"]
[]
["Montant emprunté ($)",null,{"$f":"Emprunt!D4","v":40000},null,null,"Taux effectif","Taux périodique (paiements mensuels)",null,null,null,null,null,null,null,null,null,null,null,null,null,null,"Au Canada, les taux hypothécaires affichés sont annuels, mais on les capitalise par semestre. Cela signifie que le taux nominal qu’on vous présente n’est pas le taux que vous payez réellement. Celui-ci en vient à être légèrement plus élevé."]
["Taux d'intérêt (%)",null,{"$f":"Emprunt!D5","v":5},null,null,{"$f":"((1+C4/100/12)^12)-1","v":5.116189788173342E-2},{"$f":"((1+F4)^(1/12))-1","v":4.1666666666666519E-3}]
["Amortissement* (années)",null,{"$f":"Emprunt!D6","v":7},null,null,null,null,null,null,null,null,null,null,null,null,null,null,null,null,null,null,"Prenons l’exemple d’un taux annuel fixe de 3 %. Nous commençons par trouver le taux annuel réel pour ensuite déterminer le taux périodique, c’est-à-dire celui qui s’applique sur vos versements."]
[]
[null,null,null,null,null,null,null,null,null,null,null,null,null,null,null,null,null,null,null,null,null,"Puisque la capitalisation est biannuelle, on en vient à trouver le taux périodique en utilisant les formules suivantes :"]
["Mois","Intérêts","Capital","Mensualités","Annuités",null,null,"An 1",1,2,3,4,5,6,7,8,9,10,11,12]
[1,{"$f":"-CUMIPMT($G$4,12*$C$5,$C$3,$A9,$A9,0)","v":166.66666666666606},{"$f":"-CUMPRINC($G$4,$C$5*12,$C$3,$A9,$A9,0)","v":398.68969620961389},{"$f":"SUM(B9:C9)","v":565.35636287627995},{"$f":"SUM(D9:D20)","v":6784.2763545153612},null,null,"An 2",13,14,15,16,17,18,19,20,21,22,23,24,null,"Taux annuel affiché / Nombre de périodes de capitalisation"]
[2,165.00545959912603,400.35090327715392,565.35636287627995,null,null,null,"An 3",25,26,27,28,29,30,31,32,33,34,35,36]
[3,163.33733083547122,402.01903204080872,565.35636287627995,null,null,null,"An 4",37,38,39,40,41,42,43,44,45,46,47,48,null,"Pour notre exemple on obtient : 3 % / 2 = 1,5 %"]
[4,161.66225153530121,403.69411134097874,565.35636287627995,null,null,null,"An 5",49,50,51,52,53,54,55,56,57,58,59,60]
[5,159.98019273804709,405.37617013823285,565.35636287627995,null,null,null,"An 6",61,62,63,64,65,66,67,68,69,70,71,72,null,"De par la capitalisation, on arrive à ce taux nouveau annuel : (1 + Taux par période de capitalisation)Nombre de périodes de cap.  - 1 = Taux annuel réel"]
[6,158.29112536247112,407.06523751380882,565.35636287627995,null,null,null,"An 7",73,74,75,76,77,78,79,80,81,82,83,84]
[7,156.59502020616367,408.76134267011628,565.35636287627995,null,null,null,"An 8",85,86,87,88,89,90,91,92,93,94,95,96,null,"Notre exemple nous donne : (1 + 1,5 %) 2 - 1 = 3,0225 %"]
[8,154.89184794503814,410.46451493124181,565.35636287627995,null,null,null,"An 9",97,98,99,100,101,102,103,104,105,106,107,108]
[9,153.18157913282465,412.17478374345529,565.35636287627995,null,null,null,"An 10",109,110,111,112,113,114,115,116,117,118,119,120,null,"Puisque les paiements s’effectuent sur une base mensuelle (12 fois par année), bimensuelle (24 fois par année) ou aux deux semaines (26 fois par année), on doit ajuster le tout en fonction de la périodicité."]
[10,151.46418420056028,413.89217867571966,565.35636287627995,null,null,null,"An 11",121,122,123,124,125,126,127,128,129,130,131,132]
[11,149.73963345607808,415.61672942020186,565.35636287627995,null,null,null,"An 12",133,134,135,136,137,138,139,140,141,142,143,144,null,"Si les paiements sont mensuels, on obtient ainsi ce taux périodique : (1 + 3,0225 %) 1/12 -1 = 0,248452 %"]
[12,148.0078970834939,417.34846579278604,565.35636287627995,null,null,null,"An 13",145,146,147,148,149,150,151,152,153,154,155,156]
{"$rows_left_out":289}
{"sheet":"Capitalisation semestrielle","index":5,"n_rows":308,"n_cols":22,"rows_kept":308,"cut":false,"hidden":true,"merged":[[44,4,55,4],[56,4,67,4],[68,4,79,4],[152,4,163,4],[8,4,19,4],[20,4,31,4],[32,4,43,4],[80,4,91,4],[92,4,103,4],[104,4,115,4],[164,4,175,4],[176,4,187,4],[116,4,127,4],[128,4,139,4],[140,4,151,4],[296,4,307,4],[2,0,2,1],[2,2,2,3],[3,0,3,1],[3,2,3,3],[4,0,4,1],[4,2,4,3],[260,4,271,4],[272,4,283,4],[284,4,295,4],[224,4,235,4],[236,4,247,4],[248,4,259,4],[188,4,199,4],[200,4,211,4],[212,4,223,4]]}
["Capitalisation semestrielle"]
[]
["Montant emprunté ($)",null,{"$f":"Emprunt!D4","v":40000},null,null,"Taux effectif","Taux périodique (paiements mensuels)"]
["Taux d'intérêt (%)",null,5,null,null,{"$f":"((1+C4/100/2)^2)-1","v":5.062499999999992E-2},{"$f":"(1+F4)^(1/12)-1","v":4.1239154651442345E-3},null,null,null,null,null,null,null,null,null,null,null,null,null,null,"Au Canada, les taux hypothécaires affichés sont annuels, mais on les capitalise par semestre. Cela signifie que le taux nominal qu’on vous présente n’est pas le taux que vous payez réellement. Celui-ci en vient à être légèrement plus élevé."]
["Amortissement* (années)",null,{"$f":"Emprunt!D6","v":7}]
[null,null,null,null,null,null,null,null,null,null,null,null,null,null,null,null,null,null,null,null,null,"Prenons l’exemple d’un taux annuel fixe de 3 %. Nous commençons par trouver le taux annuel réel pour ensuite déterminer le taux périodique, c’est-à-dire celui qui s’applique sur vos versements."]
[]
["Mois","Intérêts","Capital","Mensualités","Annuités",null,null,"An 1",1,2,3,4,5,6,7,8,9,10,11,12,null,"Puisque la capitalisation est biannuelle, on en vient à trouver le taux périodique en utilisant les formules suivantes :"]
[1,{"$f":"-CUMIPMT($G$4,$C$5*12,$C$3,$A9,$A9,0)","v":164.95661860576945},{"$f":"-CUMPRINC($G$4,$C$5*12,$C$3,$A9,$A9,0)","v":399.43601804301636},{"$f":"SUM(B9:C9)","v":564.39263664878581},{"$f":"SUM(D9:D20)","v":6772.7116397854297},null,null,"An 2",13,14,15,16,17,18,19,20,21,22,23,24]
[2,163.30937823362621,401.08325841515961,564.39263664878581,null,null,null,"An 3",25,26,27,28,29,30,31,32,33,34,35,36,null,"Taux annuel affiché / Nombre de périodes de capitalisation"]
[3,161.65534478143746,402.73729186734835,564.39263664878581,null,null,null,"An 4",37,38,39,40,41,42,43,44,45,46,47,48]
[4,159.99449023511545,404.39814641367036,564.39263664878581,null,null,null,"An 5",49,50,51,52,53,54,55,56,57,58,59,60,null,"Pour notre exemple on obtient : 3 % / 2 = 1,5 %"]
[5,158.32678646504445,406.06585018374136,564.39263664878581,null,null,null,"An 6",61,62,63,64,65,66,67,68,69,70,71,72]
[6,156.6522052256048,407.74043142318101,564.39263664878581,null,null,null,"An 7",73,74,75,76,77,78,79,80,81,82,83,84,null,"De par la capitalisation, on arrive à ce taux nouveau annuel : (1 + Taux par période de capitalisation)Nombre de périodes de cap.  - 1 = Taux annuel réel"]
[7,154.97071815469411,409.4219184940917,564.39263664878581,null,null,null,"An 8",85,86,87,88,89,90,91,92,93,94,95,96]
[8,153.28229677324731,411.1103398755385,564.39263664878581,null,null,null,"An 9",97,98,99,100,101,102,103,104,105,106,107,108,null,"Notre exemple nous donne : (1 + 1,5 %) 2 - 1 = 3,0225 %"]
[9,151.58691248475395,412.80572416403186,564.39263664878581,null,null,null,"An 10",109,110,111,112,113,114,115,116,117,118,119,120]
[10,149.88453657477379,414.50810007401202,564.39263664878581,null,null,null,"An 11",121,122,123,124,125,126,127,128,129,130,131,132,null,"Puisque les paiements s’effectuent sur une base mensuelle (12 fois par année), bimensuelle (24 fois par année) ou aux deux semaines (26 fois par année), on doit ajuster le tout en fonction de la périodicité."]
[11,148.17514021045099,416.21749643833482,564.39263664878581,null,null,null,"An 12",133,134,135,136,137,138,139,140,141,142,143,144]
[12,146.4586944400254,417.93394220876041,564.39263664878581,null,null,null,"An 13",145,146,147,148,149,150,151,152,153,154,155,156,null,"Si les paiements sont mensuels, on obtient ainsi ce taux périodique : (1 + 3,0225 %) 1/12 -1 = 0,248452 %"]
{"$rows_left_out":288}